{"text_format":"1","workbook":"xlsx","n_sheets":12,"sheets":["Input","Assumptions","Results Summary","Projections","Results","Summary","Summ weekend","Load profiles","Net metering","RE generation","EE interventions","Load  Balancing"],"not_rendered":{"charts":29,"images":2,"macros":1,"external_links":0,"defined_names":1,"comments":1,"pivot_tables":0},"unopened":[],"bounds":{"document_bytes":16777216,"sheet_cells":100000,"rows_first":2000,"rows_last":500,"rows_between":2000,"halvings":0,"cell_chars":16384,"cell_head_chars":4096},"cells_cut":0,"cells_raw":0,"read":"whole","date_system":"1900"}

{"sheet":"Input","index":0,"n_rows":147,"n_cols":53,"rows_kept":147,"cut":false,"hidden":false,"merged":[[8,8,8,13],[91,0,91,2],[110,4,110,5],[52,0,53,0],[104,2,105,9],[90,1,90,2],[124,5,124,12],[124,2,124,3],[118,2,118,3],[118,5,118,12],[119,5,119,12]]}
["City electricity load profile and revenue impact analysis",null,null,null,null,null,null,null,null,null,null,null,null,null,null,null,null,null,null,null,null,null,null,null,null,null,null,null,null,null,null,null,null,null,null,null,null,null,null,null,null,null,null,null,null,null,null,null,null,null,null,null,"Choose a City:"]
["Background:",null,null,null,null,null,null,null,null,null,null,null,null,null,"Instructions:",null,null,null,null,null,null,null,null,null,null,null,null,null,null,null,null,null,null,null,null,null,null,null,null,null,null,null,null,null,null,null,null,null,null,null,null,null,"BLOEM"]
["This tool has been developed by Sustainable Energy Africa (SEA), with funding from the Renewable Energy and Energy Efficiency Partnership (REEEP), and is available at no cost.",null,null,null,null,null,null,null,null,null,null,null,null,null,"Complete the coloured cells in the sheet.",null,null,null,null,null,null,null,null,null,null,null,null,null,null,null,null,null,null,null,null,null,null,null,null,null,null,null,null,null,null,null,null,null,null,null,null,null,"CTN"]
["This tool calculates the financial losses to municipalities in South Africa resulting from the uptake of embedded PV generation and energy efficiency interventions by their customer base.",null,null,null,null,null,null,null,null,null,null,null,null,null,"The tool is able to include all of these options simultaneously OR these can be analysed independently by not including any one of them in the input fields below for each scenario run.",null,null,null,null,null,null,null,null,null,null,null,null,null,null,null,null,null,null,null,null,null,null,null,null,null,null,null,null,null,null,null,null,null,null,null,null,null,"DBN"]
["The tool has the ability to project these financial losses over 10 years (year 0; 3; 5 and 10) by sector, for the residential, business and industrial sectors. ",null,null,null,null,null,null,null,null,null,null,null,null,null,"Refer to the 'Load Profile' sheet columns O to R (in orange) for typical commercial, residential and industrial user load profiles. These are generic and can be customised by changing the hourly percentage values. This is especially important for the Industrial sector, and if your summer consumption is more than in winter.",null,null,null,null,null,null,null,null,null,null,null,null,null,null,null,null,null,null,null,null,null,null,null,null,null,null,null,null,null,null,null,null,null,null,null,null,null,"JHB"]
["It incorporates current electricity load data and shows the impact of the various interventions on an hourly basis on this - refer to 'Summary' and 'Summ weekend' sheets.",null,null,null,null,null,null,null,null,null,null,null,null,null,"When all the fields have been completed, click on the arrows below.",null,null,null,null,null,null,null,null,null,null,null,null,null,null,null,null,null,null,null,null,null,null,null,null,null,null,null,null,null,null,null,null,null,null,null,null,null,"PE"]
["RE options include embedded PV for each sector, as well as landfill gas. Pumped storage (or any other load balancing) can also be inserted. There is also an option for residential load shifting. ",null,null,null,null,null,null,null,null,null,null,null,null,null,"High level results are displayed in the 'Results Summary' worksheet. For detailed results, see 'Results'; 'Summary'; 'Summ Weekend' and 'Net Metering' worksheets.",null,null,null,null,null,null,null,null,null,null,null,null,null,null,null,null,null,null,null,null,null,null,null,null,null,null,null,null,null,null,null,null,null,null,null,null,null,"PRETORIA"]
["A fixed service charge option has been included for PV customers the residential sector only, to demonstrate its potentially positive effect on municipal electricity income ",null,null,null,null,null,null,null,null,null,null,null,null,null,"DO NOT CHANGE THE FILE NAME, or the macro will not run.",null,null,null,null,null,null,null,null,null,null,null,null,null,null,null,null,null,null,null,null,null,null,null,null,null,null,null,null,null,null,null,null,null,null,null,null,null,"UPINGTON"]
{"$rows_left_out":140}
{"sheet":"Assumptions","index":1,"n_rows":14,"n_cols":1,"rows_kept":14,"cut":false,"hidden":false,"merged":[]}
["Assumptions"]
[]
["High demand = Megaflex high demand months (June - August)"]
["Low demand = Megaflex low demand months (September - May)"]
[]
["The average residential and commercial customer that is likely to adopt interventions uses more than 600kWh per month. "]
["It is assumed that the tariff level of the customer remains the same, i.e. A customer that would normally consume 950kWh per month would not drop to a lower tariff block when using PV and EE."]
["For all calculations, it is assumed that all PV owners have a SWH."]
{"$rows_left_out":7}
{"sheet":"Results Summary","index":2,"n_rows":101,"n_cols":15,"rows_kept":101,"cut":false,"hidden":false,"merged":[[3,1,3,4],[3,5,3,7],[3,8,3,10],[3,11,4,11],[3,12,4,12],[3,21,3,22],[3,23,3,24],[3,17,3,20],[3,13,4,13],[3,14,4,14]]}
["Results "]
[]
[null,"Revenue loss/surplus (R)"]
[null,"Residential",null,null,null,"Commercial",null,null,"Industrial",null,null,"Landfill gas","Load bal.","Street & Traffic lights","All interv. (no fixed Charge)"]
["year","Res PV fixed charge ","Res PV no fixed charge","SWHs","Other res EE*",null,"Comm PV no fixed charge","Commercial EE",null,"Ind PV no fixed charge","Industr EE"]
[0,{"$f":"Results!B6","v":4742.0879880091015},{"$f":"Results!C6","v":-889.67967270853569},{"$f":"Results!D6","v":-1260.8188071921613},{"$f":"Results!E6","v":-600.42614259806919},null,{"$f":"Results!G6","v":-4967.4543376445945},{"$f":"Results!H6","v":-2164.6781597033773},null,{"$f":"Results!J6","v":-124498.87656543833},{"$f":"Results!K6","v":-11367.318881505831},{"$f":"Results!L6","v":0},{"$f":"Results!M6","v":0},{"$f":"Results!N6","v":35044078.632750079},{"$f":"Results!P6","v":34898329.380183339}]
[3,{"$f":"Results!B7","v":2542464.8761435123},{"$f":"Results!C7","v":-480818.63204714807},{"$f":"Results!D7","v":-13547273.453191919},{"$f":"Results!E7","v":-6454005.0729613667},null,{"$f":"Results!G7","v":-2006922.7608885949},{"$f":"Results!H7","v":-2909630.1807643692},null,{"$f":"Results!J7","v":-13669264.541831292},{"$f":"Results!K7","v":-4608797.8592051128},{"$f":"Results!L7","v":0},{"$f":"Results!M7","v":0},{"$f":"Results!N7","v":47687719.516899034},{"$f":"Results!P7","v":4011007.016010006}]
[5,{"$f":"Results!B8","v":9125088.9795333408},{"$f":"Results!C8","v":-1945781.7397917726},{"$f":"Results!D8","v":-55069218.440747023},{"$f":"Results!E8","v":-26227776.957337722},null,{"$f":"Results!G8","v":-8140612.868804032},{"$f":"Results!H8","v":-11820296.733858583},null,{"$f":"Results!J8","v":-55032650.020981692},{"$f":"Results!K8","v":-18646277.340084992},{"$f":"Results!L8","v":0},{"$f":"Results!M8","v":0},{"$f":"Results!N8","v":58228537.204970956},{"$f":"Results!P8","v":-118602764.92915875}]
{"$rows_left_out":94}
{"sheet":"Projections","index":3,"n_rows":95,"n_cols":24,"rows_kept":95,"cut":false,"hidden":false,"merged":[[2,19,2,21],[82,6,82,7]]}
["Projections of tariffs, revenue and technology penetration",null,null,null,null,null,null,null,null,null,null,null,"Colour code:","current","year 3","year 5","year 10"]
["Penetration of different options over time",null,null,null,null,null,null,"3yrs, 5 yrs, 10 yrs, 15 years"]
["year","PV implement","SWH realistic","Other res EE (No hhs)*","Commercial PV","Commercial EE (customers)","Industrial pv","Indust EE LV (customers)","Indust EE MV (customers)","Indust EE MV TOU (customers)","Indust EE HV TOU (customers)","Streetlights","Traffic lights",null,null,null,null,null,null,"Inflation"]
[0,{"$f":"IF(Input!B78=0,0.00000001,Input!B78)","v":1E-8},{"$f":"IF(Input!C78=0,0.00000001,Input!C78)","v":1E-8},{"$f":"IF(Input!D78=0,0.00000001,Input!D78)","v":1E-8},{"$f":"IF(Input!E78=0,0.00000001,Input!E78)","v":1E-8},{"$f":"IF(Input!F78=0,0.00000001,Input!F78)","v":1E-8},{"$f":"IF(Input!G78=0,0.00000001,Input!G78)","v":1E-8},{"$f":"IF(Input!H78=0,0.00000001,Input!H78)","v":1E-8},{"$f":"IF(Input!I78=0,0.00000001,Input!I78)","v":1E-8},{"$f":"IF(Input!J78=0,0.00000001,Input!J78)","v":1E-8},{"$f":"IF(Input!K78=0,0.00000001,Input!K78)","v":1E-8},{"$f":"IF(Input!L78=0,0.00000001,Input!L78)","v":1E-8},{"$f":"IF(Input!M78=0,0.00000001,Input!M78)","v":1E-8},"Year",null,null,null,null,null,"Year","CPI forecast (%)","Inflated value","Inflated increase (%)"]
[3,{"$f":"(B7-B$4)*Input!$B$84+B4","v":0.100000009},{"$f":"(C7-C$4)*Input!$B$84+C4","v":0.100000009},{"$f":"(D7-D$4)*Input!$B$84+D4","v":0.100000009},{"$f":"(E7-E$4)*Input!$B$84+E4","v":0.100000009},{"$f":"(F7-F$4)*Input!$B$84+F4","v":0.100000009},{"$f":"(G7-G$4)*Input!$B$84+G4","v":0.100000009},{"$f":"(H7-H$4)*Input!$B$84+H4","v":0.100000009},{"$f":"(I7-I$4)*Input!$B$84+I4","v":0.100000009},{"$f":"(J7-J$4)*Input!$B$84+J4","v":0.100000009},{"$f":"(K7-K$4)*Input!$B$84+K4","v":0.100000009},{"$f":"(L7-L$4)*Input!$B$84+L4","v":0.100000009},{"$f":"(M7-M$4)*Input!$B$84+M4","v":0.100000009},0,"Elec increase (nom)",{"$f":"C15","v":0},{"$f":"(Results!B22-Results!E22)*(1+P5)*(1+K15)","v":0},{"$f":"Q5/Q7","v":{"$error":"#DIV/0!"}},null,0,null,1,0]
[5,{"$f":"(B7-B$4)*Input!$B$85+B4","v":0.35000000649999996},{"$f":"(C7-C$4)*Input!$B$85+C4","v":0.35000000649999996},{"$f":"(D7-D$4)*Input!$B$85+D4","v":0.35000000649999996},{"$f":"(E7-E$4)*Input!$B$85+E4","v":0.35000000649999996},{"$f":"(F7-F$4)*Input!$B$85+F4","v":0.35000000649999996},{"$f":"(G7-G$4)*Input!$B$85+G4","v":0.35000000649999996},{"$f":"(H7-H$4)*Input!$B$85+H4","v":0.35000000649999996},{"$f":"(I7-I$4)*Input!$B$85+I4","v":0.35000000649999996},{"$f":"(J7-J$4)*Input!$B$85+J4","v":0.35000000649999996},{"$f":"(K7-K$4)*Input!$B$85+K4","v":0.35000000649999996},{"$f":"(L7-L$4)*Input!$B$85+L4","v":0.35000000649999996},{"$f":"(M7-M$4)*Input!$B$85+M4","v":0.35000000649999996},null,"Operation cost increase (nom)",{"$f":"E15","v":0},{"$f":"Results!E22*(1+P6)*(1+K15)","v":0},{"$f":"Q6/Q7","v":{"$error":"#DIV/0!"}},null,1,{"$f":"Input!G95","v":0},{"$f":"V5*(1+(U6/100))","v":1},{"$f":"(V6-V$5)","v":0}]
[10,{"$f":"IF(Input!B79=0,1,Input!B79)","v":1},{"$f":"IF(Input!C79=0,1,Input!C79)","v":1},{"$f":"IF(Input!D79=0,1,Input!D79)","v":1},{"$f":"IF(Input!E79=0,1,Input!E79)","v":1},{"$f":"IF(Input!F79=0,1,Input!F79)","v":1},{"$f":"IF(Input!G79=0,1,Input!G79)","v":1},{"$f":"IF(Input!H79=0,1,Input!H79)","v":1},{"$f":"IF(Input!I79=0,1,Input!I79)","v":1},{"$f":"IF(Input!J79=0,1,Input!J79)","v":1},{"$f":"IF(Input!K79=0,1,Input!K79)","v":1},{"$f":"IF(Input!L79=0,1,Input!L79)","v":1},{"$f":"IF(Input!M79=0,1,Input!M79)","v":1},null,null,{"$f":"Results!C22*(1+P5)+Results!D22*(1+P6)","v":1},{"$f":"P7*Results!B22","v":0},null,null,2,{"$f":"Input!G96","v":0},{"$f":"V6*(1+(U7/100))","v":1},0]
["SWH owners load shift",{"$f":"B5*Input!B46/C5","v":0},null,null,null,null,null,null,null,null,null,null,null,null,"Nominal growth",null,{"$f":"Q7/B34-1","v":{"$error":"#DIV/0!"}},null,null,3,{"$f":"Input!G97","v":0},1,0]
{"$rows_left_out":88}
{"sheet":"Results","index":4,"n_rows":112,"n_cols":29,"rows_kept":112,"cut":false,"hidden":false,"merged":[[28,1,28,4],[28,5,28,7],[28,8,28,10],[3,5,3,7],[3,1,3,4],[12,1,12,4],[12,5,12,7],[3,8,3,10],[12,8,12,10],[28,15,29,15],[12,15,13,15],[3,15,4,15],[3,11,4,11],[3,12,4,12],[3,13,4,13],[28,11,29,11],[28,12,29,12],[28,13,29,13],[12,11,13,11],[12,12,13,12],[12,13,13,13]]}
["Results detailed"]
[]
[null,"Revenue loss (R)"]
[null,"Residential",null,null,null,"Commercial",null,null,"Industrial",null,null,"Landfill gas","Load bal.","Street & Traffic lights",null,"All interv. (no fixed Charge)"]
["year","Res PV fixed charge ","Res PV no fixed charge","SWHs","Other res EE*",null,"Comm PV no fixed charge","Commercial EE",null,"Ind PV no fixed charge","Industr EE"]
[0,4742.0879880091015,-889.67967270853569,-1260.8188071921613,-600.42614259806919,null,-4967.4543376445945,-2164.6781597033773,null,-124498.87656543833,-11367.318881505831,0,0,35044078.632750079,null,34898329.380183339]
[3,2542464.8761435123,-480818.63204714807,-13547273.453191919,-6454005.0729613667,null,-2006922.7608885949,-2909630.1807643692,null,-13669264.541831292,-4608797.8592051128,0,0,47687719.516899034,null,4011007.016010006]
[5,9125088.9795333408,-1945781.7397917726,-55069218.440747023,-26227776.957337722,null,-8140612.868804032,-11820296.733858583,null,-55032650.020981692,-18646277.340084992,0,0,58228537.204970956,null,-118602764.92915875,null,null,null,null,null,null,null,null,null,null,null,null,{"$f":"Projections!B5","v":0.100000009}]
{"$rows_left_out":105}
{"sheet":"Summary","index":5,"n_rows":214,"n_cols":33,"rows_kept":214,"cut":false,"hidden":false,"merged":[[41,14,41,16],[42,14,42,16],[43,14,43,16],[41,17,41,19],[42,17,42,19],[43,17,43,19],[41,20,41,22],[41,23,41,25],[42,20,42,22],[42,23,42,25],[43,20,43,22],[43,23,43,25],[67,1,68,1],[73,1,74,1],[60,1,61,1],[154,4,154,5],[117,0,117,1],[204,4,204,5],[204,8,204,10],[205,4,205,5],[205,8,205,10],[193,4,193,5],[193,8,193,10],[194,4,194,5],[194,8,194,10],[137,13,137,14],[138,13,138,14],[182,4,182,5],[182,8,182,10],[183,4,183,5],[183,8,183,10],[175,8,175,10],[176,4,176,5],[176,8,176,10],[155,4,155,5],[154,8,154,10],[155,8,155,10],[175,4,175,5]]}
["City electricity load profile (MW) and revenue impact analysis",null,null,null,null,null,null,null,null,null,null,null,null,"Weekday"]
[null,null,null,null,null,null,null,null,null,null,null,null,null,null,null,null,null,null,null,null,null,null,null,null,null,null,null,"Loads"]
[null,null,null,null,null,null,null,null,null,null,null,null,null,null,null,null,null,null,null,null,null,null,null,null,null,null," ","Residential",{"$f":"Input!B10","v":0},"kwh yearly"]
[null,null,null,null,null,null,null,null,null,null,null,null,null,null,null,null,null,null,null,null,null,null,null,null,null,null,null,"Commercial buildings",{"$f":"Input!B11","v":0},"kwh yearly"]
[null,null,null,null,null,null,null,null,null,null,null,null,null,null,null,null,null,null,null,null,null,null,null,null,null,null,null,"Industrial  ",{"$f":"Input!B12","v":0},"kwh yearly"]
[null,null,null,null,null,null,null,null,null,null,null,null,null,null,null,null,null,null,null,null,null,null,null,null,null,null,null,"RE generation"]
[null,null,null,null,null,null,null,null,null,null,null,null,null,null,null,null,null,null,null,null,null,null,null,null,null,null,null,"Residential PV"]
[null,null,null,null,null,null,null,null,null,null,null,null,null,null,null,null,null,null,null,null,null,null,null,null,null,null,null,"No. sys",{"$f":"Projections!B7","v":1}]
{"$rows_left_out":207}
{"sheet":"Summ weekend","index":6,"n_rows":193,"n_cols":29,"rows_kept":193,"cut":false,"hidden":false,"merged":[[172,12,172,14],[171,12,171,14],[0,27,0,29],[44,1,45,1],[51,1,52,1],[57,1,58,1]]}
["Weekend: City electricity load profile (MW) and revenue impact analysis"]
[]
[]
[]
[]
[]
[]
[]
{"$rows_left_out":186}
{"sheet":"Load profiles","index":7,"n_rows":150,"n_cols":50,"rows_kept":150,"cut":false,"hidden":false,"merged":[[122,14,122,17],[84,14,84,17],[2,26,2,49],[47,1,47,4],[47,8,47,11],[47,14,47,17],[48,16,48,17],[48,1,48,2],[48,3,48,4],[48,8,48,9],[48,10,48,11],[48,14,48,15],[123,1,123,2],[123,3,123,4],[84,1,84,4],[85,1,85,2],[85,3,85,4],[122,1,122,4]]}
["Load profiles (MW)",null,null,null,"Adjustment to full load factor",null,null,null,{"$f":"Input!B32","v":0}]
["Weekday"]
["hr",0,1,2,3,4,5,6,7,8,9,10,11,12,13,14,15,16,17,18,19,20,21,22,23]
["Winter",{"$f":"AA4*$I$1","v":0},{"$f":"AB4*$I$1","v":0},0,0,0,0,0,0,0,0,0,0,0,0,0,0,0,0,0,0,0,0,0,0,null,{"$f":"Input!B26","v":1320},{"$f":"Input!C26","v":1261},{"$f":"Input!D26","v":1244},{"$f":"Input!E26","v":1264},{"$f":"Input!F26","v":1365},{"$f":"Input!G26","v":1683},{"$f":"Input!H26","v":2111},{"$f":"Input!I26","v":2219},{"$f":"Input!J26","v":2220},{"$f":"Input!K26","v":2212},{"$f":"Input!L26","v":2319},{"$f":"Input!M26","v":2228},{"$f":"Input!N26","v":2108},{"$f":"Input!O26","v":2023},{"$f":"Input!P26","v":1981},{"$f":"Input!Q26","v":1984},{"$f":"Input!R26","v":2031},{"$f":"Input!S26","v":2212},{"$f":"Input!T26","v":2371},{"$f":"Input!U26","v":2318},{"$f":"Input!V26","v":2340},{"$f":"Input!W26","v":2058},{"$f":"Input!X26","v":1712},{"$f":"Input!Y26","v":1470}]
["Summer",{"$f":"AA5*$I$1","v":0},{"$f":"AB5*$I$1","v":0},0,0,0,0,0,0,0,0,0,0,0,0,0,0,0,0,0,0,0,0,0,0,null,{"$f":"Input!B27","v":1120},{"$f":"Input!C27","v":1080},{"$f":"Input!D27","v":1067},{"$f":"Input!E27","v":1081},{"$f":"Input!F27","v":1154},{"$f":"Input!G27","v":1388},{"$f":"Input!H27","v":1692},{"$f":"Input!I27","v":1750},{"$f":"Input!J27","v":1792},{"$f":"Input!K27","v":1804},{"$f":"Input!L27","v":1910},{"$f":"Input!M27","v":1841},{"$f":"Input!N27","v":1774},{"$f":"Input!O27","v":1739},{"$f":"Input!P27","v":1723},{"$f":"Input!Q27","v":1722},{"$f":"Input!R27","v":1729},{"$f":"Input!S27","v":1750},{"$f":"Input!T27","v":1821},{"$f":"Input!U27","v":1869},{"$f":"Input!V27","v":1853},{"$f":"Input!W27","v":1619},{"$f":"Input!X27","v":1384},{"$f":"Input!Y27","v":1226}]
[]
[]
[]
{"$rows_left_out":143}
{"sheet":"Net metering","index":8,"n_rows":312,"n_cols":60,"rows_kept":312,"cut":false,"hidden":false,"merged":[]}
[null,null,null,null,null,"Resid customers >600kwh/month"]
[null,null,null,null,null,"Average monthly consumption:",null,"kwh",{"$f":"Summary!AC3/12/Projections!F11*Summary!AC8","v":{"$error":"#DIV/0!"}}]
[null,null,null,null,null,"Size of PV panel pk DC kW",null,"kwh",{"$f":"Summary!AC8*Summary!AC9","v":2}]
[null,null,null,null,null,"Ave daily DC output per kWh pk DC pv panel kWh",null,null,{"$f":"'RE generation'!X11","v":5.1092514127118642}]
[null,null,null,null,null,"Yearly DC output per kWh pk DC pv panel kWh",null,null,{"$f":"I4*365","v":1864.8767656398304}]
[null,null,null,null,null,"Inverter efficiency :",null,null,{"$f":"1-'RE generation'!B8","v":0.82000000000000006}]
[null,null,null,null,null,"Summer- 1 day's consumption as % of yearly (weekday)",null,null,{"$f":"'Load profiles'!I59*100","v":{"$error":"#DIV/0!"}}]
[null,null,null,null,null,"Winter- 1 day's consumption as % of yearly (weekday)",null,null,{"$f":"'Load profiles'!G59*100","v":{"$error":"#DIV/0!"}}]
{"$rows_left_out":305}
{"sheet":"RE generation","index":9,"n_rows":224,"n_cols":40,"rows_kept":224,"cut":false,"hidden":false,"merged":[]}
[" RE generation ",null,"MW"]
[null,"Hour",0,1,2,3,4,5,6,7,8,9,10,11,12,13,14,15,16,17,18,19,20,21,22,23,null,"don't change below"]
["Resid PV","MW (summer)*",{"$f":"C4*$AB$5*$AC$45/(1+$B$8)","v":0},0,0,0,0,0,2.0780314878865902E-5,1.922179126295096E-4,4.9237801643535039E-4,8.0090796928962329E-4,1.0670114459328782E-3,1.2667333611575339E-3,1.360533393596859E-3,1.3593789316591442E-3,1.2456644307942395E-3,1.0268938935972898E-3,7.4722548918588648E-4,4.4562230795790214E-4,1.7403513711050192E-4,2.0203083910008512E-5,0,0,0,0,"No sys",{"$f":"Summary!AC8","v":1}]
[null,"% of max output (summer)",{"$f":"C46","v":0},{"$f":"D46","v":0},0,0,0,0,{"$f":"I46","v":1.5273652948663556E-2},0.1412812897751379,0.36190072125583367,0.58867204072974122,0.78425965210012727,0.93105642766228258,1,0.99915146372507424,0.91557064064488769,0.75477301654645734,0.54921510394569373,0.32753500212134068,0.12791684344505727,1.4849384811200678E-2,0,0,0,0,"kWp/sys",{"$f":"Summary!AC9","v":2},"kWp (rated)"]
[null,"MW (winter)*",{"$f":"C6*$AB$5*$AC$47/(1+$B$8)","v":0},0,0,0,0,0,0,1.7504135308072198E-5,2.888182325831913E-4,7.2801290031300286E-4,1.1266297998286468E-3,1.4226088150378678E-3,1.5801460328105177E-3,1.5682113951004685E-3,1.417039317439845E-3,1.0422916933442992E-3,7.2403468774298639E-4,2.8404437749917163E-4,1.5912850280065635E-5,0,0,0,0,0,"Max cap",{"$f":"AB3*AB4/1000","v":2E-3},"MWp (rated)"]
[null,"% of max output (winter)",{"$f":"C48","v":0},{"$f":"D48","v":0},0,0,0,0,0,1.1077542799597179E-2,0.18277945619335348,0.4607250755287009,0.71299093655589119,0.90030211480362543,1,0.99244712990936557,0.89677744209466259,0.65961732124874117,0.45820745216515607,0.1797583081570997,1.0070493454179255E-2,0,0,0,0,0]
["* - NB to select Wp rating factor for chosen tilt angle (in red below right) - same tilt for summer & winter (i.e. fixed mounting)",null,null,null,null,null,null,null,null,null,null,null,null,null,null,null,null,null,null,null,null,null,null,{"$f":"SUM(C3:Z3)*365*0.75","v":2.7976115821271188},null,"summer",{"$f":"SUM(C3:Z3)","v":1.0219585688135593E-2},{"$f":"AA7/X9","v":2.7400163583005716E-3}]
["System losses:",0.18,"(inverter, wiring etc)",null,null,null,null,null,null,null,null,null,null,null,null,null,null,null,null,null,null,null,null,{"$f":"SUM(C5:Z5)*365*1/4","v":0.93214194915254223},null,"winter",{"$f":"SUM(C5:Z5)","v":1.0215254237288134E-2},{"$f":"AA8/X9","v":2.7388550346873265E-3}]
{"$rows_left_out":217}
{"sheet":"EE interventions","index":10,"n_rows":64,"n_cols":62,"rows_kept":64,"cut":false,"hidden":false,"merged":[]}
["EE savings","MW"]
["Hour",0,1,2,3,4,5,6,7,8,9,10,11,12,13,14,15,16,17,18,19,20,21,22,23,null,"don't change below"]
["Streetlights (summer)",{"$f":"$AA$3*$AA$4/1000000","v":5.5000000000000002E-5},{"$f":"$AA$3*$AA$4/1000000","v":5.5000000000000002E-5},5.5000000000000002E-5,5.5000000000000002E-5,5.5000000000000002E-5,5.5000000000000002E-5,0,0,0,0,0,0,0,0,0,0,0,0,0,{"$f":"$AA$3*$AA$4/1000000","v":5.5000000000000002E-5},5.5000000000000002E-5,5.5000000000000002E-5,5.5000000000000002E-5,{"$f":"$AA$3*$AA$4/1000000","v":5.5000000000000002E-5},"No lights",{"$f":"Summary!AC47","v":1}]
["Streetlights (winter)",5.5000000000000002E-5,5.5000000000000002E-5,5.5000000000000002E-5,5.5000000000000002E-5,5.5000000000000002E-5,5.5000000000000002E-5,5.5000000000000002E-5,0,0,0,0,0,0,0,0,0,0,0,5.5000000000000002E-5,5.5000000000000002E-5,5.5000000000000002E-5,5.5000000000000002E-5,5.5000000000000002E-5,{"$f":"$AA$3*$AA$4/1000000","v":5.5000000000000002E-5},"Savings per light",{"$f":"Summary!AC48","v":55},"watts"]
["Traffic lights",{"$f":"$AA$5*$AA$7/1000000","v":6.0000000000000002E-5},{"$f":"$AA$5*$AA$7/1000000","v":6.0000000000000002E-5},6.0000000000000002E-5,6.0000000000000002E-5,6.0000000000000002E-5,6.0000000000000002E-5,6.0000000000000002E-5,6.0000000000000002E-5,6.0000000000000002E-5,6.0000000000000002E-5,6.0000000000000002E-5,6.0000000000000002E-5,6.0000000000000002E-5,6.0000000000000002E-5,6.0000000000000002E-5,6.0000000000000002E-5,6.0000000000000002E-5,6.0000000000000002E-5,6.0000000000000002E-5,6.0000000000000002E-5,6.0000000000000002E-5,6.0000000000000002E-5,6.0000000000000002E-5,6.0000000000000002E-5,"No lights on at one time",{"$f":"Summary!AC50","v":1}]
[null,null,null,null,null,null,null,null,null,null,null,null,null,null,null,null,null,null,null,null,null,null,null,null,null,"Av demand/light",{"$f":"Summary!AC51","v":75},"watts"]
[null,null,null,null,null,null,null,null,null,null,null,null,null,null,null,null,null,null,null,null,null,null,null,null,null,"Savings per light",{"$f":"Summary!AC52","v":60},"watts"]
["Comm EE (HVAC, lights etc)",{"$f":"$AA$8*$AA$10/1000/5","v":{"$error":"#DIV/0!"}},{"$f":"$AA$8*$AA$10/1000/5","v":{"$error":"#DIV/0!"}},{"$error":"#DIV/0!"},{"$error":"#DIV/0!"},{"$error":"#DIV/0!"},{"$error":"#DIV/0!"},{"$error":"#DIV/0!"},{"$f":"$AA$8*$AA$10/1000","v":{"$error":"#DIV/0!"}},{"$error":"#DIV/0!"},{"$error":"#DIV/0!"},{"$error":"#DIV/0!"},{"$error":"#DIV/0!"},{"$error":"#DIV/0!"},{"$error":"#DIV/0!"},{"$error":"#DIV/0!"},{"$error":"#DIV/0!"},{"$error":"#DIV/0!"},{"$error":"#DIV/0!"},{"$f":"$AA$8*$AA$10/1000/5","v":{"$error":"#DIV/0!"}},{"$error":"#DIV/0!"},{"$error":"#DIV/0!"},{"$error":"#DIV/0!"},{"$error":"#DIV/0!"},{"$error":"#DIV/0!"},"No. of customers",{"$f":"Summary!AC36","v":1}]
{"$rows_left_out":57}
{"sheet":"Load  Balancing","index":11,"n_rows":17,"n_cols":27,"rows_kept":17,"cut":false,"hidden":false,"merged":[]}
["Load balancing","MW",null,null,"Type:","Pumped storage"]
["Hour",0,1,2,3,4,5,6,7,8,9,10,11,12,13,14,15,16,17,18,19,20,21,22,23,"don't change below"]
["Power generated",null,null,null,null,null,null,null,{"$f":"$Z$3/5","v":0},{"$f":"$Z$3/5","v":0},{"$f":"$Z$3/5","v":0},null,null,null,null,null,null,null,null,{"$f":"$Z$3/5","v":0},{"$f":"$Z$3/5","v":0},null,null,null,null,{"$f":"Summary!AC20","v":0}]
["Power used",{"$f":"$Z$4/8","v":0},0,0,0,0,0,null,null,null,null,null,null,null,null,null,null,null,null,null,null,null,null,{"$f":"$Z$4/8","v":0},{"$f":"$Z$4/8","v":0},{"$f":"Summary!AC21","v":0}]
["Nett:",{"$f":"B3-B4","v":0},{"$f":"C3-C4","v":0},0,0,0,0,0,0,0,0,0,0,0,0,0,0,0,0,0,0,0,0,0,0,{"$f":"Z3/Z4","v":{"$error":"#DIV/0!"}},"eff"]
[]
["Megaflex periods:","off pk","off pk","off pk","off pk","off pk","off pk","std","peak","peak","peak","std","std","std","std","std","std","std","std","peak","peak","std","std","off pk","off pk"]
[]
{"$rows_left_out":9}